�s���{���R�[�h���͎s�撬���R�[�h,NO,�s���{����,�s�撬����,����,����_�J�i,����_�ʏ�,POI�R�[�h,�Z��,����,�ܓx,�o�x,�d�b�ԍ�,�����ԍ�,�@�l�ԍ�,�c�̖�,���p�\�j��,�J�n����,�I������,���p�\���ԓ��L����,����,�o���A�t���[���,URL,���l
362085,,������,�O�D�s,�O�D�s�����{����,�~���V�V���N�V���z���`���E�V��,,,�������O�D�s�r�c���V���}�`1500-2,,34.121908,133.483548,0883-72-7600,,,,���ΐ��؋�,08:30,17:15,,�j���y��12��29���`1��3���͕�,���ړI�g�C���L��;�G���x�[�^�[�L��,,
362085,,������,�O�D�s,�O�D�s������,�~���V�V�u���`���E�V��,,,�������O�D�s�r�c���}�`2145-1,,34.129683,133.481301,0883-72-7620,,,,���ΐ��؋�,08:30,17:15,,�j���y��12��29���`1��3���͕�,�X���[�v�L��,,
362085,,������,�O�D�s,�O�D�s�����ɑ�񒡎�,�~���V�u���`���E�V���_�C�j�`���E�V��,,,�������O�D�s�r�c���}�`2549-1,,34.131396,133.481268,0883-72-7681,,,,���ΐ��؋�,08:30,17:15,,�j���y��12��29���`1��3���͕�,�X���[�v�L��,,
362085,,������,�O�D�s,�O�D�s����ψ������,�~���V�V�L���E�C�N�C�C���J�C�W���V��,,,�������O�D�s�r�c���T���_1737-1,,34.131166,133.485132,0883-72-3555,,,,���ΐ��؋�,08:30,17:15,,�j���y��12��29���`1��3���͕�,,,
362085,,������,�O�D�s,�O�D�s�����������q��Ďx����,�~���V�V�t�N�V�W���V���R�\�_�e�V�G���J,,,�������O�D�s�r�c���V���}�`1474-1,,34.122366,133.484704,0883-72-7648,,,,���ΐ��؋�,08:30,17:15,,�j���y��12��29���`1��3���͕�,�X���[�v�L��,,
362085,,������,�O�D�s,�O�D�s���ێ�������,�~���V�V�J���L���E�J�W���V���g�E,,,�������O�D�s�r�c���V���}�`1395-1,,34.118790,133.485592,0883-72-3436,,,,���ΐ��؋�,08:30,17:15,,�j���y��12��29���`1��3���͕�,,,
362085,,������,�O�D�s,�O�D�s�O��x��,�~���V�~�m�V�V��,,,�������O�D�s�O�쒬�Ő�1039,,34.219543,133.582358,0883-72-2311,,,,���ΐ��؋�,08:30,17:15,,�j���y��12��29���`1��3���͕�,�X���[�v�L��,,
362085,,������,�O�D�s,�O�D�s�R��x��,�~���V�V���}�V���V�V��,,,�������O�D�s�R�钬��쎝518-9,,33.572589,133.452090,0883-86-1111,,,,���ΐ��؋�,08:30,17:15,,�j���y��12��29���`1��3���͕�,�G���x�[�^�[�L��;�X���[�v�L��,,
362085,,������,�O�D�s,�O�D�s���x��,�~���V�V�C�J���V�V��,,,�������O�D�s��쒬��73-1,,34.130724,133.525648,0883-78-5001,,,,���ΐ��؋�,08:30,17:15,,�j���y��12��29���`1��3���͕�,�G���x�[�^�[�L��;�X���[�v�L��,,
362085,,������,�O�D�s,�O�D�s���c�J�x��,�~���V�V�q�K�V�C���V�V��,,,�������O�D�s���c�J����157-2,,33.515240,133.542577,0883-88-2211,,,,���ΐ��؋�,08:30,17:15,,�j���y��12��29���`1��3���͕�,�X���[�v�L��,,
362085,,������,�O�D�s,�O�D�s���c�J�x��,�~���V�V�j�V�C���V�V��,,,�������O�D�s���c�J�R����F343-2,,33.532218,133.491110,0883-87-2211,,,,���ΐ��؋�,08:30,17:15,,�j���y��12��29���`1��3���͕�,���ړI�g�C���L��;�G���x�[�^�[�L��;�X���[�v�L��,,
362085,,������,�O�D�s,�O�D�s�ی��Z���^�[,�~���V�V�z�P���Z���^�[,,,�������O�D�s�r�c���V���}�`1476-1,,34.122421,133.484579,0883-72-6767,,,,���ΐ��؋��y��,08:30,21:00,,���ړI�z�[���A�W��̑ݏo���Ώہ@12��29���`1��3���͕�,���ړI�g�C���L��;�G���x�[�^�[�L��;�X���[�v�L��,,���N�Â���ۓ��̋Ɩ����Ԃ͌��`���@8:30�`17:15
362086,,������,�O�D�s,�O�D�s�������N�ی��s���O��a�@,�~���V�V�R�N�~���P���R�E�z�P���V���c�~�m�r���E�C��,,,�������O�D�s�O�쒬�Ő�1270-30,,34.227809,133.585796,0883-77-2323,,,,���ΐ��؋�,08:30,16:30,,�y�j���A���j���A�j���y��12��29���`1��3���͕�,���ړI�g�C���L��;�G���x�[�^�[�L��;�X���[�v�L��,,
362085,,������,�O�D�s,�O�D�s�������N�ی������f�Ï�,�~���V�V�R�N�~���P���R�E�z�P���I�I�{�P�V�������E�V��,,,�������O�D�s�R�钬�㖼1584-3-3,,33.523187,133.454434,0883-84-1021,,,,���ΐ���,08:30,17:00,,�ؗj���͌ߑO�f�Â̂݁A�j���y��12��29���`1��3���͕�,���ړI�g�C���L��;�X���[�v�L��,,12:00�`13:00�̊Ԃ͋x�f
362086,,������,�O�D�s,�O�D�s�������N�ی����f�Ï�,�~���V�V�R�N�~���P���R�E�z�P���I�I�m�V�������E�V��,,,�������O�D�s�R�钬���508-2,,,,0883-76-6550,,,,��,13:30,16:30,,�j���y��12��29���`1��3���͕�,,,12:00�`13:00�̊Ԃ͋x�f
362085,,������,�O�D�s,�O�D�s�������N�ی����c�J�f�Ï�,�~���V�V�R�N�~���P���R�E�z�P���q�K�V�C���V�������E�V��,,,�������O�D�s���c�J����14-3,,33.515346,133.543285,0883-88-2300,,,,�ΐ���,09:30,16:00,,�j���y��12��29���`1��3���͕�,���ړI�g�C���L��;�X���[�v�L��,,12:00�`13:00�̊Ԃ͋x�f
362085,,������,�O�D�s,���c�J���Ȑf�Ï�,�q�K�V�C���V�J�V�������E�V��,,,�������O�D�s���c�J����168-6,,33.515083,133.542167,0883-88-2022,,,,�ΐ����y,09:00,18:00,,�j���y��12��29���`1��3���͕�,,,13:00�`14:30�̊Ԃ͋x�f
362085,,������,�O�D�s,�O�D�s�������N�ی����c�J�R���f�Ï�,�~���V�V�R�N�~���P���R�E�z�P���j�V�C�����}���������E�V��,,,�������O�D�s���c�J�R����F368-9,,33.531650,133.491050,0883-87-2360,,,,���ΐ��؋�,08:30,17:00,,�y�j���A���j���A�j���y��12��29���`1��3���͕�,���ړI�g�C���L��;�X���[�v�L��,,
362085,,������,�O�D�s,�O�D�s�w�Z���H�Z���^�[,�~���V�V�K�b�R�E�L���E�V���N�Z���^�[,,,�������O�D�s�r�c���B�Ñ�[1271-1,,34.157972,133.502375,0883-72-0738,,,,���ΐ��؋�,08:30,17:15,,�j���y��12��29���`1��3���͕�,,,
362085,,������,�O�D�s,�O�D�s�����}����,�~���V�V�`���E�I�E�g�V���J��,,,�������O�D�s�r�c���}�`2476-2,,34.127164,133.482718,0883-72-2781,,,,���Ζ؋��y��,10:00,19:00,,�j���y��12��29���`1��3���͕�,,,
362085,,������,�O�D�s,�O�D�s���}����,�~���V�V�C�J���g�V���J��,,,�������O�D�s��쒬����O64,,34.128786,133.524546,0883-78-4311,,,,�����؋��y��,09:00,19:00,,�j���y��12��29���`1��3���͕�,,,
362085,,������,�O�D�s,�O��}����,�~���V�V�~�m�g�V���V�c,,,�������O�D�s�O�쒬�Ő�1039,,34.219543,133.582358,0883-77-2248,,,,�ΐ��؋��y��,09:00,19:00,,���j���y��12��29���`1��3���͋x��,,,�y�j���A���j���A�j����17:00��
362085,,������,�O�D�s,�O�D�s����������,�~���V�V�`���E�I�R�E�~���J��,,,�������O�D�s�r�c���}�`2476,,34.134506,133.483745,0883-72-3700,,,,�����؋��y��,09:00,22:00,,�Ηj���A�j���y��12��29���`1��3���͋x��,���ړI�g�C���L��;�G���x�[�^�[�L��;�X���[�v�L��,,
362085,,������,�O�D�s,�O�������,�~�m�R�E�~���J��,,,�������O�D�s�O�쒬�Ő�1028-3,,34.219653,133.582606,0883-77-2248,,,,���ΐ��؋�,09:00,22:00,,�y�j���A���j���A�j���y��12��29���`1��3���͋x��,,,
362085,,������,�O�D�s,�R�������,���}�V���R�E�~���J��,,,�������O�D�s�R�钬��쎝544,,33.572573,133.445911,0883-86-1135,,,,���ΐ��؋�,09:00,22:00,,�y�j���A���j���A�j���y��12��29���`1��3���͋x��,,,
362085,,������,�O�D�s,��������,�C�J���R�E�~���J��,,,�������O�D�s��쒬��73-1,,34.130724,133.525648,0883-78-5010,,,,���ΐ��؋�,09:00,22:00,,�y�j���A���j���A�j���y��12��29���`1��3���͋x��,,,
362085,,������,�O�D�s,���c�J������,�j�V�C���R�E�~���J��,,,�������O�D�s���c�J�R����F343-2,,33.532218,133.491110,0883-87-2211,,,,���ΐ��؋�,09:00,22:00,,�y�j���A���j���A�j���y��12��29���`1��3���͋x��,,,
362085,,������,�O�D�s,���c�J������,�q�K�V�C���R�E�~���J��,,,�������O�D�s���c�J����157-2,,33.515240,133.542577,0883-88-2211,,,,���ΐ��؋�,09:00,22:00,,�y�j���A���j���A�j���y��12��29���`1��3���͋x��,,,
362085,,������,�O�D�s,���g�r�c�����̉ƁE���΂�������,�A���C�P�_�E�_�c�m�G�C�E�^�o�R�V�����E�J��,,,�������O�D�s�r�c���}�`2465-1,,34.134235,133.484206,0883-72-3450,,,,���Ζ؋��y��,09:00,17:00,,12��28���`1��4���͋x��,,,
362085,,������,�O�D�s,���c�J���j����������,�q�K�V�C�����L�V�~���]�N�V�����E�J��,,,�������O�D�s���c�J����14-3,,33.515346,133.543285,0883-88-2286,,,,���Ζ؋��y��,10:00,16:00,,12�`2���̓y�E���j�A12��28���`1��3���͋x��,���ړI�g�C���L��;�G���x�[�^�[�L��;�X���[�v�L��,,
362085,,������,�O�D�s,�O��̈��,�~�m�^�C�C�N�J��,,,�������O�D�s�O�쒬�Ő�1293-30,,34.253877,133.575958,0883-77-2248,,,,���ΐ��؋��y��,09:00,22:00,,12��29���`1��3���͕�,,,
362085,,������,�O�D�s,�g���^������,���V�m�K���E���h�E�R�E�G��,,,�������O�D�s�r�c���C�^�m3256-1,,34.115767,133.472024,0883-72-5755,,,,���ΐ��؋��y��,08:00,22:00,,12��29���`1��3���͕�,,,
362085,,������,�O�D�s,�r�c�����̈��,�C�P�_�\�E�S�E�^�C�C�N�J��,,,�������O�D�s�r�c���}�`2551-1,,34.129813,133.484860,0883-72-5755,,,,���ΐ��؋��y��,09:00,22:00,,12��29���`1��3���͕�,���ړI�g�C���L��;�G���x�[�^�[�L��;�X���[�v�L��,,
362085,,������,�O�D�s,�r�c�Α���,�C�P�_�J�\�E�W���E,,,�������O�D�s�r�c�����}�_520,,34.114500,133.491994,0883-72-0969,,,,���ΐ��؋��y��,10:00,15:00,,1��1��,���ړI�g�C���L��;�X���[�v�L��,https://www.miyoshi.i-tokushima.jp/docs/4589.html,
